{"text_format":"1","workbook":"xlsx","n_sheets":6,"sheets":["DATA","Sheet","Order","Ohjeet","Levyt","weights"],"not_rendered":{"charts":0,"images":6,"macros":1,"external_links":2,"defined_names":48,"comments":0,"pivot_tables":0},"unopened":[],"bounds":{"document_bytes":16777216,"sheet_cells":100000,"rows_first":2000,"rows_last":500,"rows_between":2000,"halvings":0,"cell_chars":16384,"cell_head_chars":4096},"cells_cut":0,"cells_raw":0,"read":"whole","date_system":"1900"}

{"sheet":"DATA","index":0,"n_rows":49,"n_cols":10,"rows_kept":49,"cut":false,"hidden":true,"merged":[]}
[]
[]
[]
[]
[]
[]
[]
[]
[]
[]
[]
[]
[]
[]
[]
[]
[]
[]
[]
[]
{"$rows_left_out":30}
{"sheet":"Sheet","index":1,"n_rows":52,"n_cols":40,"rows_kept":52,"cut":false,"hidden":false,"merged":[[1,6,1,10],[4,8,4,10],[2,6,2,11],[3,6,3,11],[5,4,6,4],[27,0,27,2],[25,0,25,2],[7,0,7,2],[5,24,5,26],[5,12,5,14],[5,18,5,20],[51,8,51,9],[49,8,49,9],[51,14,51,20],[50,14,50,20],[51,26,51,30],[51,12,51,13],[51,24,51,25],[49,24,49,25],[49,26,49,30],[49,14,49,20],[50,26,50,30],[50,8,50,9],[49,12,49,13]]}
[7,1]
[28,4,null,null,null,null,"Kajaanin Kuohu"]
[null,null,null,null,null,null,"Raw-Voimanosto",null,null,null,null,null,null,null,null,null,null,null,null,null,null,0]
[null,null,null,null,null,null,"15.9.2012 Kajaani"]
[null,null,null,null,null,null,null,null,{"$f":"IF(Levyt!A1=\"\",\"\",Levyt!$A$1)","v":""},null,null,{"$f":"IF($A$11=\"RYHMÄN LOPPU\",$B$29,$B$11)","v":0}]
[{"$f":"Order!A7","v":"MAASTANOSTO"},null,null,null,null,"Sij.","M/N","Nro","Sarja","Paino","Nimi","Seura","JALKAKYYKKY",null,null,"JK",null,null,"PENKKIPUNNERRUS",null,null,"PP",null,"Väli-","MAASTANOSTO",null,null,"MN",null,"Yht.","Wilks","Sij.","JK","PP","MN","Kerr.",null,"Telinekorkeus",null,"Seur."]
["NOSTOJÄRJESTYS",null,null,null,null,null,null,null,null,null,"(Etunimi Sukunimi / SV)",null,"1.","2.","3.","tulos",null,null,"1.","2.","3.","tulos",null,"tulos","1.","2.","3.","tulos",null,"tulos","pist.",null,"4.","4.","4.",null,null,"JK","PP","pist."]
[null,null,null,null,null,{"$f":"AF8","v":0},null,null,null,null,"Ryhmä 3",null,null,null,null,0,{"$f":"IF(Paino1=\"\",\"\",IF(_JK1=\" ----- \",\" ----- \",IF(_JK1=0,,VLOOKUP(_JK1,_pai1,1))))","v":""},null,null,null,null,0,{"$f":"IF(Paino1=\"\",\"\",IF(_PP1=\" ----- \",\" ----- \",IF(_PP1=0,,VLOOKUP(_PP1,x,1))))","v":""},{"$f":"IF(P8=\"\",\"\",IF(P8=\" ----- \",\"out\",IF(V8=0,P8,IF(V8=\" ----- \",\"out\",P8+V8))))","v":0},null,null,null,0,{"$f":"IF(Paino1=\"\",\"\",IF(_MV1=\" ----- \",\" ----- \",IF(_MV1=0,,VLOOKUP(_MV1,x,1))))","v":""},{"$f":"IF(Paino1=\"\",\"\",IF(_JK1=\" ----- \",\"out\",IF(_PP1=\" ----- \",\"out\",IF(_MV1=\" ----- \",\"out\",P8+V8+AB8))))","v":""},{"$f":"IF(Paino1=\"\",\"\",IF(YHT1=\"out\",\"\",YHT1*Kerroin1))","v":""},0,null,null,null,{"$f":"IF(Paino1=\"\",\"\",IF(G8=\"M\",500/(DATA!$E$24+DATA!$F$24*J8+DATA!$G$24*J8^2+DATA!$H$24*J8^3+DATA!$I$24*J8^4+DATA!$J$24*J8^5),500/(DATA!$E$25+DATA!$F$25*J8+DATA!$G$25*J8^2+DATA!$H$25*J8^3+DATA!$I$25*J8^4+DATA!$J$25*J8^5)))","v":""},{"$f":"IF(Paino1=\"\",\"\",IF(_JK1=\" ----- \",1,IF(_PP1=\" ----- \",2,IF(_MV1=\" ----- \",3,P8+V8+AB8))))","v":""},null,null,{"$f":"IF(AF8=\"\",\"\",IF(AF8=1,12,CHOOSE(AF8,12,9,8,7,6,5,4,3,2,1)))","v":{"$error":"#VALUE!"}}]
["NIMI","kg","tk",null,null,{"$f":"AF9","v":0},null,null,null,null,null,null,null,null,null,0,"",null,null,null,null,0,"",{"$f":"IF(P9=\"\",\"\",IF(P9=\" ----- \",\"out\",IF(V9=0,P9,IF(V9=\" ----- \",\"out\",P9+V9))))","v":0},null,null,null,0,"","","",null,null,null,null,{"$f":"IF(Paino1=\"\",\"\",IF(G9=\"M\",500/(DATA!$E$24+DATA!$F$24*J9+DATA!$G$24*J9^2+DATA!$H$24*J9^3+DATA!$I$24*J9^4+DATA!$J$24*J9^5),500/(DATA!$E$25+DATA!$F$25*J9+DATA!$G$25*J9^2+DATA!$H$25*J9^3+DATA!$I$25*J9^4+DATA!$J$25*J9^5)))","v":""},"",null,null,{"$f":"IF(AF9=\"\",\"\",IF(AF9=1,12,CHOOSE(AF9,12,9,8,7,6,5,4,3,2,1)))","v":""}]
[null,null,null,null,null,1,"M",16,"120",118.55,"Jari Saario / -85","KP",220,240,250,250,{"$f":"IF(Paino1=\"\",\"\",IF(_JK1=\" ----- \",\" ----- \",IF(_JK1=0,,VLOOKUP(_JK1,_pai1,1))))","v":{"$error":"#NAME?"}},null,170,185,187.5,187.5,{"$f":"IF(Paino1=\"\",\"\",IF(_PP1=\" ----- \",\" ----- \",IF(_PP1=0,,VLOOKUP(_PP1,x,1))))","v":{"$error":"#NAME?"}},{"$f":"IF(P10=\"\",\"\",IF(P10=\" ----- \",\"out\",IF(V10=0,P10,IF(V10=\" ----- \",\"out\",P10+V10))))","v":437.5},270,292.5,302.5,302.5,{"$f":"IF(Paino1=\"\",\"\",IF(_MV1=\" ----- \",\" ----- \",IF(_MV1=0,,VLOOKUP(_MV1,x,1))))","v":{"$error":"#NAME?"}},{"$f":"IF(Paino1=\"\",\"\",IF(_JK1=\" ----- \",\"out\",IF(_PP1=\" ----- \",\"out\",IF(_MV1=\" ----- \",\"out\",P10+V10+AB10))))","v":740},{"$f":"IF(Paino1=\"\",\"\",IF(YHT1=\"out\",\"\",YHT1*Kerroin1))","v":426.66889715497717},1,null,null,null,{"$f":"IF(Paino1=\"\",\"\",IF(G10=\"M\",500/(DATA!$E$24+DATA!$F$24*J10+DATA!$G$24*J10^2+DATA!$H$24*J10^3+DATA!$I$24*J10^4+DATA!$J$24*J10^5),500/(DATA!$E$25+DATA!$F$25*J10+DATA!$G$25*J10^2+DATA!$H$25*J10^3+DATA!$I$25*J10^4+DATA!$J$25*J10^5)))","v":0.57657959074996912},{"$f":"IF(Paino1=\"\",\"\",IF(_JK1=\" ----- \",1,IF(_PP1=\" ----- \",2,IF(_MV1=\" ----- \",3,P10+V10+AB10))))","v":740},null,null,12]
[{"$f":"UPPER(IF(Order!F8<>\"\",IF(Order!E8<99998,Order!D8,),))","v":"RYHMÄN LOPPU"},{"$f":"IF(Order!F8<>\"\",IF(Order!E8<90000,Order!E8-Order!F8*1000,),)","v":0},{"$f":"IF(Order!F8<>\"\",IF(Order!E8<90000,Order!A8,),)","v":0},null,null,1,"M",17,"120+",147.69999999999999,"Janne Huusko / -79","JuPu",245,260,270,270,{"$f":"IF(Paino1=\"\",\"\",IF(_JK1=\" ----- \",\" ----- \",IF(_JK1=0,,VLOOKUP(_JK1,_pai1,1))))","v":{"$error":"#NAME?"}},null,170,180,190,180,{"$f":"IF(Paino1=\"\",\"\",IF(_PP1=\" ----- \",\" ----- \",IF(_PP1=0,,VLOOKUP(_PP1,x,1))))","v":{"$error":"#NAME?"}},450,250,270,285,285,{"$f":"IF(Paino1=\"\",\"\",IF(_MV1=\" ----- \",\" ----- \",IF(_MV1=0,,VLOOKUP(_MV1,x,1))))","v":{"$error":"#NAME?"}},735,407.55841513282581,1,null,null,null,{"$f":"IF(Paino1=\"\",\"\",IF(G11=\"M\",500/(DATA!$E$24+DATA!$F$24*J11+DATA!$G$24*J11^2+DATA!$H$24*J11^3+DATA!$I$24*J11^4+DATA!$J$24*J11^5),500/(DATA!$E$25+DATA!$F$25*J11+DATA!$G$25*J11^2+DATA!$H$25*J11^3+DATA!$I$25*J11^4+DATA!$J$25*J11^5)))","v":0.5545012450786746},735,null,null,12]
[null,null,null,"Rack",null,1,"M",18,"105",97.35,"Jyrki Koivisto / -80","KP",220,240,245,245,{"$f":"IF(Paino1=\"\",\"\",IF(_JK1=\" ----- \",\" ----- \",IF(_JK1=0,,VLOOKUP(_JK1,_pai1,1))))","v":{"$error":"#NAME?"}},null,165,175,180,175,{"$f":"IF(Paino1=\"\",\"\",IF(_PP1=\" ----- \",\" ----- \",IF(_PP1=0,,VLOOKUP(_PP1,x,1))))","v":{"$error":"#NAME?"}},{"$f":"IF(P12=\"\",\"\",IF(P12=\" ----- \",\"out\",IF(V12=0,P12,IF(V12=\" ----- \",\"out\",P12+V12))))","v":420},260,280,null,260,{"$f":"IF(Paino1=\"\",\"\",IF(_MV1=\" ----- \",\" ----- \",IF(_MV1=0,,VLOOKUP(_MV1,x,1))))","v":{"$error":"#NAME?"}},{"$f":"IF(Paino1=\"\",\"\",IF(_JK1=\" ----- \",\"out\",IF(_PP1=\" ----- \",\"out\",IF(_MV1=\" ----- \",\"out\",P12+V12+AB12))))","v":680},{"$f":"IF(Paino1=\"\",\"\",IF(YHT1=\"out\",\"\",YHT1*Kerroin1))","v":418.45958886501018},1,null,null,null,{"$f":"IF(Paino1=\"\",\"\",IF(G12=\"M\",500/(DATA!$E$24+DATA!$F$24*J12+DATA!$G$24*J12^2+DATA!$H$24*J12^3+DATA!$I$24*J12^4+DATA!$J$24*J12^5),500/(DATA!$E$25+DATA!$F$25*J12+DATA!$G$25*J12^2+DATA!$H$25*J12^3+DATA!$I$25*J12^4+DATA!$J$25*J12^5)))","v":0.61538174833089732},{"$f":"IF(Paino1=\"\",\"\",IF(_JK1=\" ----- \",1,IF(_PP1=\" ----- \",2,IF(_MV1=\" ----- \",3,P12+V12+AB12))))","v":680},null,null,12]
[{"$f":"UPPER(IF(Order!F9<>\"\",IF(Order!E9<99998,Order!D9,),))","v":""},{"$f":"IF(Order!F9<>\"\",IF(Order!E9<90000,Order!E9-Order!F9*1000,),)","v":0},{"$f":"IF(Order!F9<>\"\",IF(Order!E9<90000,Order!A9,),)","v":0},null,null,2,"M",21,"105",103.9,"Juha Simonen / -77","OPT",150,170,180,180,{"$f":"IF(Paino1=\"\",\"\",IF(_JK1=\" ----- \",\" ----- \",IF(_JK1=0,,VLOOKUP(_JK1,_pai1,1))))","v":{"$error":"#NAME?"}},null,175,185,201,185,{"$f":"IF(Paino1=\"\",\"\",IF(_PP1=\" ----- \",\" ----- \",IF(_PP1=0,,VLOOKUP(_PP1,x,1))))","v":{"$error":"#NAME?"}},365,220,235,245,235,{"$f":"IF(Paino1=\"\",\"\",IF(_MV1=\" ----- \",\" ----- \",IF(_MV1=0,,VLOOKUP(_MV1,x,1))))","v":{"$error":"#NAME?"}},600,359.87891392860979,2,null,null,null,{"$f":"IF(Paino1=\"\",\"\",IF(G13=\"M\",500/(DATA!$E$24+DATA!$F$24*J13+DATA!$G$24*J13^2+DATA!$H$24*J13^3+DATA!$I$24*J13^4+DATA!$J$24*J13^5),500/(DATA!$E$25+DATA!$F$25*J13+DATA!$G$25*J13^2+DATA!$H$25*J13^3+DATA!$I$25*J13^4+DATA!$J$25*J13^5)))","v":0.5997981898810163},600,null,null,9]
[{"$f":"UPPER(IF(Order!F10<>\"\",IF(Order!E10<99998,Order!D10,),))","v":""},{"$f":"IF(Order!F10<>\"\",IF(Order!E10<90000,Order!E10-Order!F10*1000,),)","v":0},{"$f":"IF(Order!F10<>\"\",IF(Order!E10<90000,Order!A10,),)","v":0},{"$f":"IF(Order!F8<>\"\",IF(Order!E8<99998,Order!A8,),)","v":0},null,3,"M",19,"105",102.9,"Markus Vilppola / -84","KiimU",195,205,212.5,205,{"$f":"IF(Paino1=\"\",\"\",IF(_JK1=\" ----- \",\" ----- \",IF(_JK1=0,,VLOOKUP(_JK1,_pai1,1))))","v":{"$error":"#NAME?"}},null,140,150,155,140,{"$f":"IF(Paino1=\"\",\"\",IF(_PP1=\" ----- \",\" ----- \",IF(_PP1=0,,VLOOKUP(_PP1,x,1))))","v":{"$error":"#NAME?"}},345,230,245,260,245,{"$f":"IF(Paino1=\"\",\"\",IF(_MV1=\" ----- \",\" ----- \",IF(_MV1=0,,VLOOKUP(_MV1,x,1))))","v":{"$error":"#NAME?"}},590,355.13577057058961,3,null,null,null,{"$f":"IF(Paino1=\"\",\"\",IF(G14=\"M\",500/(DATA!$E$24+DATA!$F$24*J14+DATA!$G$24*J14^2+DATA!$H$24*J14^3+DATA!$I$24*J14^4+DATA!$J$24*J14^5),500/(DATA!$E$25+DATA!$F$25*J14+DATA!$G$25*J14^2+DATA!$H$25*J14^3+DATA!$I$25*J14^4+DATA!$J$25*J14^5)))","v":0.60192503486540616},590,null,null,8]
[{"$f":"UPPER(IF(Order!F11<>\"\",IF(Order!E11<99998,Order!D11,),))","v":""},{"$f":"IF(Order!F11<>\"\",IF(Order!E11<90000,Order!E11-Order!F11*1000,),)","v":0},{"$f":"IF(Order!F11<>\"\",IF(Order!E11<90000,Order!A11,),)","v":0},null,null,4,"M",20,"105",105,"Markus Ahonen / -90","VarpVi",150,170,180,180,{"$f":"IF(Paino1=\"\",\"\",IF(_JK1=\" ----- \",\" ----- \",IF(_JK1=0,,VLOOKUP(_JK1,_pai1,1))))","v":{"$error":"#NAME?"}},null,170,180,182.5,180,{"$f":"IF(Paino1=\"\",\"\",IF(_PP1=\" ----- \",\" ----- \",IF(_PP1=0,,VLOOKUP(_PP1,x,1))))","v":{"$error":"#NAME?"}},360,200,230,250,230,{"$f":"IF(Paino1=\"\",\"\",IF(_MV1=\" ----- \",\" ----- \",IF(_MV1=0,,VLOOKUP(_MV1,x,1))))","v":{"$error":"#NAME?"}},590,352.55659842525068,4,null,null,null,{"$f":"IF(Paino1=\"\",\"\",IF(G15=\"M\",500/(DATA!$E$24+DATA!$F$24*J15+DATA!$G$24*J15^2+DATA!$H$24*J15^3+DATA!$I$24*J15^4+DATA!$J$24*J15^5),500/(DATA!$E$25+DATA!$F$25*J15+DATA!$G$25*J15^2+DATA!$H$25*J15^3+DATA!$I$25*J15^4+DATA!$J$25*J15^5)))","v":0.59755355665296728},590,null,null,7]
[{"$f":"UPPER(IF(Order!F12<>\"\",IF(Order!E12<99998,Order!D12,),))","v":""},{"$f":"IF(Order!F12<>\"\",IF(Order!E12<90000,Order!E12-Order!F12*1000,),)","v":0},{"$f":"IF(Order!F12<>\"\",IF(Order!E12<90000,Order!A12,),)","v":0},{"$f":"IF(Order!F9<>\"\",IF(Order!E9<99998,Order!A9,),)","v":0},null,6,"M",22,"105",93.8,"Pentti Räisänen / -65","KajKu",140,150,160,160,{"$f":"IF(Paino1=\"\",\"\",IF(_JK1=\" ----- \",\" ----- \",IF(_JK1=0,,VLOOKUP(_JK1,_pai1,1))))","v":{"$error":"#NAME?"}},null,140,150,150,140,{"$f":"IF(Paino1=\"\",\"\",IF(_PP1=\" ----- \",\" ----- \",IF(_PP1=0,,VLOOKUP(_PP1,x,1))))","v":{"$error":"#NAME?"}},300,190,200,210,210,{"$f":"IF(Paino1=\"\",\"\",IF(_MV1=\" ----- \",\" ----- \",IF(_MV1=0,,VLOOKUP(_MV1,x,1))))","v":{"$error":"#NAME?"}},510,319.09012013810064,6,null,null,null,{"$f":"IF(Paino1=\"\",\"\",IF(G16=\"M\",500/(DATA!$E$24+DATA!$F$24*J16+DATA!$G$24*J16^2+DATA!$H$24*J16^3+DATA!$I$24*J16^4+DATA!$J$24*J16^5),500/(DATA!$E$25+DATA!$F$25*J16+DATA!$G$25*J16^2+DATA!$H$25*J16^3+DATA!$I$25*J16^4+DATA!$J$25*J16^5)))","v":0.62566690223156984},510,null,null,5]
[{"$f":"UPPER(IF(Order!F13<>\"\",IF(Order!E13<99998,Order!D13,),))","v":""},{"$f":"IF(Order!F13<>\"\",IF(Order!E13<90000,Order!E13-Order!F13*1000,),)","v":0},{"$f":"IF(Order!F13<>\"\",IF(Order!E13<90000,Order!A13,),)","v":0},{"$f":"IF(Order!F10<>\"\",IF(Order!E10<99998,Order!A10,),)","v":0},null,1,"M",25,"93",91.4,"Vili Honkanen / -89","PaPu",200,215,null,200,{"$f":"IF(Paino1=\"\",\"\",IF(_JK1=\" ----- \",\" ----- \",IF(_JK1=0,,VLOOKUP(_JK1,_pai1,1))))","v":{"$error":"#NAME?"}},null,182,185,190,185,{"$f":"IF(Paino1=\"\",\"\",IF(_PP1=\" ----- \",\" ----- \",IF(_PP1=0,,VLOOKUP(_PP1,x,1))))","v":{"$error":"#NAME?"}},385,260,275,290,275,{"$f":"IF(Paino1=\"\",\"\",IF(_MV1=\" ----- \",\" ----- \",IF(_MV1=0,,VLOOKUP(_MV1,x,1))))","v":{"$error":"#NAME?"}},660,418.0979188661899,1,null,null,null,{"$f":"IF(Paino1=\"\",\"\",IF(G17=\"M\",500/(DATA!$E$24+DATA!$F$24*J17+DATA!$G$24*J17^2+DATA!$H$24*J17^3+DATA!$I$24*J17^4+DATA!$J$24*J17^5),500/(DATA!$E$25+DATA!$F$25*J17+DATA!$G$25*J17^2+DATA!$H$25*J17^3+DATA!$I$25*J17^4+DATA!$J$25*J17^5)))","v":0.63348169525180287},660,null,null,12]
[{"$f":"UPPER(IF(Order!F14<>\"\",IF(Order!E14<99998,Order!D14,),))","v":""},{"$f":"IF(Order!F14<>\"\",IF(Order!E14<90000,Order!E14-Order!F14*1000,),)","v":0},{"$f":"IF(Order!F14<>\"\",IF(Order!E14<90000,Order!A14,),)","v":0},{"$f":"IF(Order!F11<>\"\",IF(Order!E11<99998,Order!A11,),)","v":0},null,3,"M",23,"93",91.2,"Timo Salminen / -80","So-Vi",175,180,185,180,{"$f":"IF(Paino1=\"\",\"\",IF(_JK1=\" ----- \",\" ----- \",IF(_JK1=0,,VLOOKUP(_JK1,_pai1,1))))","v":{"$error":"#NAME?"}},null,115,120,125,125,{"$f":"IF(Paino1=\"\",\"\",IF(_PP1=\" ----- \",\" ----- \",IF(_PP1=0,,VLOOKUP(_PP1,x,1))))","v":{"$error":"#NAME?"}},305,65,null,null,65,{"$f":"IF(Paino1=\"\",\"\",IF(_MV1=\" ----- \",\" ----- \",IF(_MV1=0,,VLOOKUP(_MV1,x,1))))","v":{"$error":"#NAME?"}},370,234.64176920390679,3,null,null,null,{"$f":"IF(Paino1=\"\",\"\",IF(G18=\"M\",500/(DATA!$E$24+DATA!$F$24*J18+DATA!$G$24*J18^2+DATA!$H$24*J18^3+DATA!$I$24*J18^4+DATA!$J$24*J18^5),500/(DATA!$E$25+DATA!$F$25*J18+DATA!$G$25*J18^2+DATA!$H$25*J18^3+DATA!$I$25*J18^4+DATA!$J$25*J18^5)))","v":0.63416694379434269},370,null,null,8]
[{"$f":"UPPER(IF(Order!F15<>\"\",IF(Order!E15<99998,Order!D15,),))","v":""},{"$f":"IF(Order!F15<>\"\",IF(Order!E15<90000,Order!E15-Order!F15*1000,),)","v":0},{"$f":"IF(Order!F15<>\"\",IF(Order!E15<90000,Order!A15,),)","v":0},{"$f":"IF(Order!F12<>\"\",IF(Order!E12<99998,Order!A12,),)","v":0},null,0,"M",24,"93",null,"Pekka Tervo / -85","So-Vi",null,null,null," ----- ",{"$f":"IF(Paino1=\"\",\"\",IF(_JK1=\" ----- \",\" ----- \",IF(_JK1=0,,VLOOKUP(_JK1,_pai1,1))))","v":""},null,null,null,null," ----- ",{"$f":"IF(Paino1=\"\",\"\",IF(_PP1=\" ----- \",\" ----- \",IF(_PP1=0,,VLOOKUP(_PP1,x,1))))","v":""},"out",null,null,null," ----- ",{"$f":"IF(Paino1=\"\",\"\",IF(_MV1=\" ----- \",\" ----- \",IF(_MV1=0,,VLOOKUP(_MV1,x,1))))","v":""},"","",null,null,null,null,{"$f":"IF(Paino1=\"\",\"\",IF(G19=\"M\",500/(DATA!$E$24+DATA!$F$24*J19+DATA!$G$24*J19^2+DATA!$H$24*J19^3+DATA!$I$24*J19^4+DATA!$J$24*J19^5),500/(DATA!$E$25+DATA!$F$25*J19+DATA!$G$25*J19^2+DATA!$H$25*J19^3+DATA!$I$25*J19^4+DATA!$J$25*J19^5)))","v":""},"",null,null,""]
[{"$f":"UPPER(IF(Order!F16<>\"\",IF(Order!E16<99998,Order!D16,),))","v":""},{"$f":"IF(Order!F16<>\"\",IF(Order!E16<90000,Order!E16-Order!F16*1000,),)","v":0},{"$f":"IF(Order!F16<>\"\",IF(Order!E16<90000,Order!A16,),)","v":0},{"$f":"IF(Order!F13<>\"\",IF(Order!E13<99998,Order!A13,),)","v":0},null,5,"M",26,"105",95.65,"Heikki Marin / -87","Ii-Body",150,170,180,170,{"$error":"#NAME?"},null,110,120,130,120,{"$error":"#NAME?"},{"$f":"IF(P20=\"\",\"\",IF(P20=\" ----- \",\"out\",IF(V20=0,P20,IF(V20=\" ----- \",\"out\",P20+V20))))","v":290},210,230,240,230,{"$error":"#NAME?"},{"$f":"IF(Paino1=\"\",\"\",IF(_JK1=\" ----- \",\"out\",IF(_PP1=\" ----- \",\"out\",IF(_MV1=\" ----- \",\"out\",P20+V20+AB20))))","v":520},{"$f":"IF(Paino1=\"\",\"\",IF(YHT1=\"out\",\"\",YHT1*Kerroin1))","v":322.46647037125143},5,null,null,null,{"$f":"IF(Paino1=\"\",\"\",IF(G20=\"M\",500/(DATA!$E$24+DATA!$F$24*J20+DATA!$G$24*J20^2+DATA!$H$24*J20^3+DATA!$I$24*J20^4+DATA!$J$24*J20^5),500/(DATA!$E$25+DATA!$F$25*J20+DATA!$G$25*J20^2+DATA!$H$25*J20^3+DATA!$I$25*J20^4+DATA!$J$25*J20^5)))","v":0.62012782763702201},{"$f":"IF(Paino1=\"\",\"\",IF(_JK1=\" ----- \",1,IF(_PP1=\" ----- \",2,IF(_MV1=\" ----- \",3,P20+V20+AB20))))","v":520},null,null,6]
{"$rows_left_out":33}
{"sheet":"Order","index":2,"n_rows":88,"n_cols":33,"rows_kept":88,"cut":false,"hidden":false,"merged":[]}
[8,22,28]
[]
[1,2,3,4,5,6,7,8,9,10,11,12,13,null,null,null,null,null,null,null,1,2,3,4,5,6,7,8,9,10,11,12,13]
[]
[null,"pisteet","nro",null,null,null,null,null,null,"tulos","sarja","paino",null,null,null,null,null,null,null,null,{"$f":"COLUMN()","v":21},"pistee","nro",null,null,null,null,null,null,"tulos","sarja","paino"]
[]
["MAASTANOSTO",null,null,null,null,null,null,null,null,null,null,null,null,null,null,null,null,null,null,null,"KYYKKY"]
[null,null,"Loppu","Ryhmän loppu",99997,"Loppu",null,null,null,null,null,null,{"$f":"IF(J8<>\"\",IF(J8>0,1,0),0)","v":0},null,null,null,null,null,null,null,null,null,11,"Nimi 9",2500,null,1,30,2,null,null,null,{"$f":"IF(AD8<>\"\",IF(AD8>0,1,0),0)","v":0}]
["","",24,"Pekka Tervo / -85",99998,null,3,19,1,"","93",null,{"$f":"IF(J9<>\"\",IF(J9>0,IF(K8=K9,M8+1,1),0),0)","v":0},null,null,null,null,null,null,null,null,null,11,"Nimi 9",3500,null,1,30,3,null,null,null,{"$f":"IF(AD9<>\"\",IF(AD9>0,IF(AE8=AE9,AG8+1,1),0),0)","v":0}]
["",null,24,"Pekka Tervo / -85",99998,null,3,19,2,null,null,null,{"$f":"IF(J10<>\"\",IF(J10>0,IF(K9=K10,M9+1,1),0),0)","v":0},null,null,null,null,null,null,null,null,null,"Loppu","Ryhmän loppu",99997,"Loppu",null,null,null,null,null,null,{"$f":"IF(AD10<>\"\",IF(AD10>0,IF(AE9=AE10,AG9+1,1),0),0)","v":0}]
["",null,24,"Pekka Tervo / -85",99998,null,3,19,3,null,null,null,0,null,null,null,null,null,null,null,null,"",12,"Nimi 10",99998,null,1,31,1,"",48,null,0]
[{"$error":"#VALUE!"},"",null,"Ryhmä 3",99998,null,3,8,1,"",null,null,0,null,null,null,null,null,null,null,null,null,12,"Nimi 10",99998,null,1,31,2,null,null,null,0]
["","",null,null,99998,null,3,9,1,"",null,null,0,null,null,null,null,null,null,null,null,null,12,"Nimi 10",99998,null,1,31,3,null,null,null,0]
[{"$error":"#VALUE!"},null,null,"Ryhmä 3",99998,null,3,8,2,null,null,null,0,null,null,null,null,null,null,null,null,"",13,"Nimi 11",99998,null,1,32,1,"",48,null,0]
["",null,null,null,99998,null,3,9,2,null,null,null,0,null,null,null,null,null,null,null,null,null,13,"Nimi 11",99998,null,1,32,2,null,null,null,0]
[{"$error":"#VALUE!"},null,null,"Ryhmä 3",99998,null,3,8,3,null,null,null,0,null,null,null,null,null,null,null,null,null,13,"Nimi 11",99998,null,1,32,3,null,null,null,0]
["",null,null,null,99998,null,3,9,3,null,null,null,0,null,null,null,null,null,null,null,null,"",14,"Nimi 12",99998,null,1,33,1,"",48,null,0]
[12,426.66889715497717,16,"Jari Saario / -85",100000,null,3,10,1,740,"120",118.55,1,null,null,null,null,null,null,null,null,null,14,"Nimi 12",99998,null,1,33,2,null,null,null,0]
[12,null,16,"Jari Saario / -85",100000,null,3,10,2,null,null,null,0,null,null,null,null,null,null,null,null,null,14,"Nimi 12",99998,null,1,33,3,null,null,null,0]
[12,null,16,"Jari Saario / -85",100000,null,3,10,3,null,null,null,0,null,null,null,null,null,null,null,null,"",15,"Nimi 13",99998,null,1,34,1,"",48,null,0]
{"$rows_left_out":69}
{"sheet":"Ohjeet","index":3,"n_rows":52,"n_cols":12,"rows_kept":52,"cut":false,"hidden":false,"merged":[[15,5,15,6],[17,7,17,9],[17,13,17,15],[40,0,46,14]]}
["Tiedosto pitää avata makrojen kanssa"]
["Nostajan rivillä pitää olla täytettynä sarakkeet  |M/N| (M = Mies / N =Nainen) ,|Nro|, |Sarja|, |Paino|, |Nimi /SV| |Seura|  (SV = syntymävuosi, muodossa vv)"]
["Sarja -sarakkeessa pitää olla eri ikäluokkia varten eri teksti. Esim. jos on eri veteraani-ikäluokka, mutta sama painoluokka, pitää ne erottaa jollakin toisistaan esim. 59M40, 59M50 jne. Ensin merkitään sarja ja sen perään "]
["ikäluokkalyhenne ilman välilyöntiä."]
["Makrot käynnistetään klikkaamalla ao. painiketta: Hyväksy, Hylkää, Korjaa, Ryhmät, Nostojärjestys, Ennätys. Makrot käynnistyvät myös pikavalintanäppäinyhdistelmällä (ctrl+_)."]
["Aloituspainojen syötön jälkeen käynnistetään jonkun syötetyn painon päällä Nostojärjestys -makro (ctrl+l). Tämä järjestää 7 seuraavaa nostajaa vasemmalla olevaan kentään nostojärjestykseen."]
["Noston hyväksyminen (Hyväksy) (ctrl+g) ja hylkääminen (Hylkää) (ctrl+f) käynnistää myös Nostojärjestys -makron."]
["\"Korjaa\" ei käynnistä \"Nostojärjestys\"-makroa. Korjaa -makron käynnistämisen ja sen jälkeen tehdyn korjauksen jälkeen tulee käynnistää Nostojärjestys -makro, joka järjestää nostajat uudelleen oikean järjestykseen."]
["Ryhmän viimeisen nostajan jälkeen vasemman sarakkeen nostojärjestykseen tulee teksti \"Ryhmän loppu\"."]
["Jos samassa pöytäkirjassa on kaksi ryhmää, tulee vasempaan sarakkeeseen kummallekin ryhmälle oma nostojärjestys näyttö."]
["Ryhmäjako -kohdan voi valita menemällä kyseiselle riville jollekin tietosarakkeelle (M/N, Nro, Sarja, Paino, Nimi, Seura) ja käynnistämällä Ryhmät -makron (ctrl+d). Jos on vain 1 ryhmä niin ryhmäjako valitaan riville 46"]
["(rivillä 46 on teksti: Ennätykset)."]
["Ennätys -makro (ctrl+e) siirtää valitun tuloksen pöytäkirjan alalaitaan nimitietoineen ja nostotietoineen. Vie kursori siihen soluun, jossa ennätys on ja klikkaa Ennätys -painiketta, jolloin tiedot siirtyvät pöytäkirjan riville 46. "]
["Sarja luetaan sarakkeesta |Sarja|. Ennätyksen laji (jos muu kuin SE) pitää lisätä käsin. Mahtuu kuusi (6) ennätystä (riveille 46-48)."]
["Pöytäkirjan perässä on sarakkeet telinekorkeuksille, jotka ilmestyvät näkyviin pöytäkirjan vasemmassa reunassa, vaaleanpunaisella alueella olevaan nostojärjestystaulukkoon."]
[]
[]
["Sij.","M/N","Nro","Sarja","Paino","Nimi","Seura","PENKKIPUNNERRUS",null,null,"Tulos","Wilks"]
[null,null,null,null,null,"(Etunimi Sukunimi / SV)",null,"1.","2.","3.",null,"pist."]
[null,null,null,null,null,null,null,null,null,null,null,""]
{"$rows_left_out":33}
{"sheet":"Levyt","index":4,"n_rows":1,"n_cols":1,"rows_kept":1,"cut":false,"hidden":false,"merged":[]}
[{"$f":"IF(Sheet!$L$5=0,\"\",VLOOKUP(Sheet!$L$5,weights!$A$2:$D$947,2))","v":""}]

{"sheet":"weights","index":5,"n_rows":947,"n_cols":4,"rows_kept":947,"cut":false,"hidden":true,"merged":[]}
["kg","Plates on each side of the bar / 25 kg","kg","Plates on each side of the bar / 20 kg"]
[27.5,"1*1,25",27.5,"1*1,25"]
[28,"1*1,25   0,25",28,"1*1,25   0,25"]
[28.5,"1*1,25   0,5",28.5,"1*1,25   0,5"]
[29,"1*1,25   0,5   0,25",29,"1*1,25   0,5   0,25"]
[29.5,"1*1,25   1,0   ",29.5,"1*1,25   1,0   "]
[30,"1*2,5",30,"1*2,5"]
[30.5,"1*2,5   0,25",30.5,"1*2,5   0,25"]
[31,"1*2,5   0,5",31,"1*2,5   0,5"]
[31.5,"1*2,5   0,5   0,25",31.5,"1*2,5   0,5   0,25"]
[32,"1*2,5   1,0",32,"1*2,5   1,0"]
[32.5,"1*2,5   1,25",32.5,"1*2,5   1,25"]
[33,"1*2,5   1,25   0,25",33,"1*2,5   1,25   0,25"]
[33.5,"1*2,5   1,25   0,5     ",33.5,"1*2,5   1,25   0,5     "]
[34,"1*2,5   1,25   0,5   0,25",34,"1*2,5   1,25   0,5   0,25"]
[34.5,"1*2,5   1,25   1,0",34.5,"1*2,5   1,25   1,0"]
[35,"1*5",35,"1*5"]
[35.5,"1*5   0,25",35.5,"1*5   0,25"]
[36,"1*5   0,5",36,"1*5   0,5"]
[36.5,"1*5   0,5   0,25",36.5,"1*5   0,5   0,25"]
{"$rows_left_out":927}